{"text_format":"1","workbook":"xlsx","n_sheets":6,"sheets":["402B Input","Export_B","Output_B","Pivot_B","Data_B","Lists"],"not_rendered":{"charts":0,"images":1,"macros":1,"external_links":0,"defined_names":3,"comments":0,"pivot_tables":1},"unopened":[],"bounds":{"document_bytes":16777216,"sheet_cells":100000,"rows_first":2000,"rows_last":500,"rows_between":2000,"halvings":0,"cell_chars":16384,"cell_head_chars":4096},"cells_cut":0,"cells_raw":0,"read":"whole","date_system":"1900"}

{"sheet":"402B Input","index":0,"n_rows":88,"n_cols":17,"rows_kept":88,"cut":false,"hidden":false,"merged":[[0,1,0,2],[0,3,0,14],[1,4,1,10],[2,6,2,8],[2,3,2,5],[2,9,2,11],[1,11,1,14],[1,0,4,0],[5,0,82,0],[3,13,3,14],[3,8,3,12],[1,1,1,2],[2,1,2,2],[86,1,86,10],[86,11,86,14],[85,1,85,2],[83,0,86,0],[2,12,2,14],[3,3,3,7],[84,13,84,14],[83,3,83,13],[84,3,84,12],[83,1,83,2]]}
["Cells are locked except for where data can be entered. A red value followed by an exclamation point indicates an invalid value.",0,null,0]
[0,"U.S. Department of Labor\n",null,0,"Jobs for Veterans State Grants Expenditure Detail Report",null,null,null,null,null,null,0]
[null,"Veterans' Employment and Training Service",null,0,null,null,"Cumulative / Accrual Basis",null,null,0,null,null,"OMB Control Number: 1293-0009"]
[null,{"$f":"VALUE(RIGHT($C$4,2))","v":{"$error":"#VALUE!"}},null,"<-- Enter your full Grant Number (ex. DV-12345-20-55-5-1)",null,null,null,null,0,null,null,null,null," Expiration Date: 10/31/2022"]
[null,"Item No.","Item Name","Year 1\nQuarter 1","Year 1\nQuarter 2","Year 1\nQuarter 3","Year 1\nQuarter 4","Year 2\nQuarter 1","Year 2\nQuarter 2","Year 2\nQuarter 3","Year 2\nQuarter 4","Year 3\nQuarter 1","Year 3\nQuarter 2","Year 3\nQuarter 3","Year 3\nQuarter 4",null,"5) Final Report:  Yes"]
[0,"A.1","State (based on Grant Number above)",{"$f":"IF(ISERROR(Lists!P23),,(Lists!P23))","v":0},{"$f":"$D$6","v":0},{"$f":"$D$6","v":0},0,0,0,0,0,0,0,0,0]
[null,"A.2","Quarter Ending (based on Grant Number above)",{"$f":"IF(ISERROR(VLOOKUP(Lists!$N$22,Lists!$Q$19:$AD$26,3)),\"\",VLOOKUP(Lists!$N$22,Lists!$Q$19:$AD$26,3))","v":""},{"$f":"IF(ISERROR(VLOOKUP(Lists!$N$22,Lists!$Q$19:$AD$26,4)),\"\",VLOOKUP(Lists!$N$22,Lists!$Q$19:$AD$26,4))","v":""},{"$f":"IF(ISERROR(VLOOKUP(Lists!$N$22,Lists!$Q$19:$AD$26,5)),\"\",VLOOKUP(Lists!$N$22,Lists!$Q$19:$AD$26,5))","v":""},{"$f":"IF(ISERROR(VLOOKUP(Lists!$N$22,Lists!$Q$19:$AD$26,6)),\"\",VLOOKUP(Lists!$N$22,Lists!$Q$19:$AD$26,6))","v":""},{"$f":"IF(ISERROR(VLOOKUP(Lists!$N$22,Lists!$Q$19:$AD$26,7)),\"\",VLOOKUP(Lists!$N$22,Lists!$Q$19:$AD$26,7))","v":""},{"$f":"IF(ISERROR(VLOOKUP(Lists!$N$22,Lists!$Q$19:$AD$26,8)),\"\",VLOOKUP(Lists!$N$22,Lists!$Q$19:$AD$26,8))","v":""},{"$f":"IF(ISERROR(VLOOKUP(Lists!$N$22,Lists!$Q$19:$AD$26,9)),\"\",VLOOKUP(Lists!$N$22,Lists!$Q$19:$AD$26,9))","v":""},{"$f":"IF(ISERROR(VLOOKUP(Lists!$N$22,Lists!$Q$19:$AD$26,10)),\"\",VLOOKUP(Lists!$N$22,Lists!$Q$19:$AD$26,10))","v":""},{"$f":"IF(ISERROR(VLOOKUP(Lists!$N$22,Lists!$Q$19:$AD$26,11)),\"\",VLOOKUP(Lists!$N$22,Lists!$Q$19:$AD$26,11))","v":""},{"$f":"IF(ISERROR(VLOOKUP(Lists!$N$22,Lists!$Q$19:$AD$26,12)),\"\",VLOOKUP(Lists!$N$22,Lists!$Q$19:$AD$26,12))","v":""},{"$f":"IF(ISERROR(VLOOKUP(Lists!$N$22,Lists!$Q$19:$AD$26,13)),\"\",VLOOKUP(Lists!$N$22,Lists!$Q$19:$AD$26,13))","v":""},{"$f":"IF(ISERROR(VLOOKUP(Lists!$N$22,Lists!$Q$19:$AD$26,14)),\"\",VLOOKUP(Lists!$N$22,Lists!$Q$19:$AD$26,14))","v":""}]
[null,"A.3","Grant Number (enter above; results not shown here)",{"$f":"$C$4","v":0},{"$f":"$D$8","v":0},{"$f":"$D$8","v":0},0,0,0,0,0,0,0,0,0]
[null,"A.4","Date Prepared"]
[null,"A.5","Is this the final report for this grant year? (Select No/Yes)"]
[null,"B.1","DVOP Total Funds"]
[null,"B.2","Consolidated Total Funds"]
[null,"B.3","LVER Total Funds"]
[null,"B.4","Incentive Award Total Funds",null,null,null,null,{"$f":"$G$14","v":0},{"$f":"$G$14","v":0},0,0,0,0,0,0]
[null,"B.5","Total Approved Funds",{"$f":"IF(ROUND((SUM(D11:D14)),0)=0,0,ROUND((SUM(D11:D14)),0))","v":0},0,0,0,0,0,0,0,0,0,0,0]
{"$rows_left_out":74}
{"sheet":"Export_B","index":1,"n_rows":80,"n_cols":14,"rows_kept":80,"cut":false,"hidden":false,"merged":[]}
["Item No.","Item Name","Year 1 Quarter 1","Year 1 Quarter 2","Year 1 Quarter 3","Year 1 Quarter 4","Year 2 Quarter 1","Year 2 Quarter 2","Year 2 Quarter 3","Year 2 Quarter 4","Year 3 Quarter 1","Year 3 Quarter 2","Year 3 Quarter 3","Year 3 Quarter 4"]
[{"$f":"'402B Input'!B6","v":"A.1"},{"$f":"'402B Input'!C6","v":"State (based on Grant Number above)"},{"$f":"'402B Input'!D6","v":0},{"$f":"'402B Input'!E6","v":0},{"$f":"'402B Input'!F6","v":0},{"$f":"'402B Input'!G6","v":0},{"$f":"'402B Input'!H6","v":0},{"$f":"'402B Input'!I6","v":0},{"$f":"'402B Input'!J6","v":0},{"$f":"'402B Input'!K6","v":0},{"$f":"'402B Input'!L6","v":0},{"$f":"'402B Input'!M6","v":0},{"$f":"'402B Input'!N6","v":0},{"$f":"'402B Input'!O6","v":0}]
[{"$f":"'402B Input'!B7","v":"A.2"},{"$f":"'402B Input'!C7","v":"Quarter Ending (based on Grant Number above)"},{"$f":"'402B Input'!D7","v":""},{"$f":"'402B Input'!E7","v":""},{"$f":"'402B Input'!F7","v":""},{"$f":"'402B Input'!G7","v":""},{"$f":"'402B Input'!H7","v":""},{"$f":"'402B Input'!I7","v":""},{"$f":"'402B Input'!J7","v":""},{"$f":"'402B Input'!K7","v":""},{"$f":"'402B Input'!L7","v":""},{"$f":"'402B Input'!M7","v":""},{"$f":"'402B Input'!N7","v":""},{"$f":"'402B Input'!O7","v":""}]
[{"$f":"'402B Input'!B8","v":"A.3"},{"$f":"'402B Input'!C8","v":"Grant Number (enter above; results not shown here)"},{"$f":"'402B Input'!D8","v":0},{"$f":"'402B Input'!E8","v":0},{"$f":"'402B Input'!F8","v":0},{"$f":"'402B Input'!G8","v":0},{"$f":"'402B Input'!H8","v":0},{"$f":"'402B Input'!I8","v":0},{"$f":"'402B Input'!J8","v":0},{"$f":"'402B Input'!K8","v":0},{"$f":"'402B Input'!L8","v":0},{"$f":"'402B Input'!M8","v":0},{"$f":"'402B Input'!N8","v":0},{"$f":"'402B Input'!O8","v":0}]
[{"$f":"'402B Input'!B9","v":"A.4"},{"$f":"'402B Input'!C9","v":"Date Prepared"},{"$f":"'402B Input'!D9","v":0},{"$f":"'402B Input'!E9","v":0},{"$f":"'402B Input'!F9","v":0},{"$f":"'402B Input'!G9","v":0},{"$f":"'402B Input'!H9","v":0},{"$f":"'402B Input'!I9","v":0},{"$f":"'402B Input'!J9","v":0},{"$f":"'402B Input'!K9","v":0},{"$f":"'402B Input'!L9","v":0},{"$f":"'402B Input'!M9","v":0},{"$f":"'402B Input'!N9","v":0},{"$f":"'402B Input'!O9","v":0}]
[{"$f":"'402B Input'!B10","v":"A.5"},{"$f":"'402B Input'!C10","v":"Is this the final report for this grant year? (Select No/Yes)"},{"$f":"'402B Input'!D10","v":0},{"$f":"'402B Input'!E10","v":0},{"$f":"'402B Input'!F10","v":0},{"$f":"'402B Input'!G10","v":0},{"$f":"'402B Input'!H10","v":0},{"$f":"'402B Input'!I10","v":0},{"$f":"'402B Input'!J10","v":0},{"$f":"'402B Input'!K10","v":0},{"$f":"'402B Input'!L10","v":0},{"$f":"'402B Input'!M10","v":0},{"$f":"'402B Input'!N10","v":0},{"$f":"'402B Input'!O10","v":0}]
[{"$f":"'402B Input'!B11","v":"B.1"},{"$f":"'402B Input'!C11","v":"DVOP Total Funds"},{"$f":"ROUND('402B Input'!D11,0)","v":0},{"$f":"ROUND('402B Input'!E11,0)","v":0},{"$f":"ROUND('402B Input'!F11,0)","v":0},{"$f":"ROUND('402B Input'!G11,0)","v":0},{"$f":"ROUND('402B Input'!H11,0)","v":0},{"$f":"ROUND('402B Input'!I11,0)","v":0},{"$f":"ROUND('402B Input'!J11,0)","v":0},{"$f":"ROUND('402B Input'!K11,0)","v":0},{"$f":"ROUND('402B Input'!L11,0)","v":0},{"$f":"ROUND('402B Input'!M11,0)","v":0},{"$f":"ROUND('402B Input'!N11,0)","v":0},{"$f":"ROUND('402B Input'!O11,0)","v":0}]
[{"$f":"'402B Input'!B12","v":"B.2"},{"$f":"'402B Input'!C12","v":"Consolidated Total Funds"},{"$f":"ROUND('402B Input'!D12,0)","v":0},{"$f":"ROUND('402B Input'!E12,0)","v":0},{"$f":"ROUND('402B Input'!F12,0)","v":0},{"$f":"ROUND('402B Input'!G12,0)","v":0},{"$f":"ROUND('402B Input'!H12,0)","v":0},{"$f":"ROUND('402B Input'!I12,0)","v":0},{"$f":"ROUND('402B Input'!J12,0)","v":0},{"$f":"ROUND('402B Input'!K12,0)","v":0},{"$f":"ROUND('402B Input'!L12,0)","v":0},{"$f":"ROUND('402B Input'!M12,0)","v":0},{"$f":"ROUND('402B Input'!N12,0)","v":0},{"$f":"ROUND('402B Input'!O12,0)","v":0}]
[{"$f":"'402B Input'!B13","v":"B.3"},{"$f":"'402B Input'!C13","v":"LVER Total Funds"},{"$f":"ROUND('402B Input'!D13,0)","v":0},{"$f":"ROUND('402B Input'!E13,0)","v":0},{"$f":"ROUND('402B Input'!F13,0)","v":0},{"$f":"ROUND('402B Input'!G13,0)","v":0},{"$f":"ROUND('402B Input'!H13,0)","v":0},{"$f":"ROUND('402B Input'!I13,0)","v":0},{"$f":"ROUND('402B Input'!J13,0)","v":0},{"$f":"ROUND('402B Input'!K13,0)","v":0},{"$f":"ROUND('402B Input'!L13,0)","v":0},{"$f":"ROUND('402B Input'!M13,0)","v":0},{"$f":"ROUND('402B Input'!N13,0)","v":0},{"$f":"ROUND('402B Input'!O13,0)","v":0}]
[{"$f":"'402B Input'!B14","v":"B.4"},{"$f":"'402B Input'!C14","v":"Incentive Award Total Funds"},{"$f":"ROUND('402B Input'!D14,0)","v":0},{"$f":"ROUND('402B Input'!E14,0)","v":0},{"$f":"ROUND('402B Input'!F14,0)","v":0},{"$f":"ROUND('402B Input'!G14,0)","v":0},{"$f":"ROUND('402B Input'!H14,0)","v":0},{"$f":"ROUND('402B Input'!I14,0)","v":0},{"$f":"ROUND('402B Input'!J14,0)","v":0},{"$f":"ROUND('402B Input'!K14,0)","v":0},{"$f":"ROUND('402B Input'!L14,0)","v":0},{"$f":"ROUND('402B Input'!M14,0)","v":0},{"$f":"ROUND('402B Input'!N14,0)","v":0},{"$f":"ROUND('402B Input'!O14,0)","v":0}]
[{"$f":"'402B Input'!B15","v":"B.5"},{"$f":"'402B Input'!C15","v":"Total Approved Funds"},{"$f":"ROUND('402B Input'!D15,0)","v":0},{"$f":"ROUND('402B Input'!E15,0)","v":0},{"$f":"ROUND('402B Input'!F15,0)","v":0},{"$f":"ROUND('402B Input'!G15,0)","v":0},{"$f":"ROUND('402B Input'!H15,0)","v":0},{"$f":"ROUND('402B Input'!I15,0)","v":0},{"$f":"ROUND('402B Input'!J15,0)","v":0},{"$f":"ROUND('402B Input'!K15,0)","v":0},{"$f":"ROUND('402B Input'!L15,0)","v":0},{"$f":"ROUND('402B Input'!M15,0)","v":0},{"$f":"ROUND('402B Input'!N15,0)","v":0},{"$f":"ROUND('402B Input'!O15,0)","v":0}]
[{"$f":"'402B Input'!B16","v":"C.1.a.(a)"},{"$f":"'402B Input'!C16","v":"Base Positions Paid for DVOP Activities: (Previous)"},{"$f":"'402B Input'!D16","v":0},{"$f":"'402B Input'!E16","v":0},{"$f":"'402B Input'!F16","v":0},{"$f":"'402B Input'!G16","v":0},{"$f":"'402B Input'!H16","v":0},{"$f":"'402B Input'!I16","v":0},{"$f":"'402B Input'!J16","v":0},{"$f":"'402B Input'!K16","v":0},{"$f":"'402B Input'!L16","v":0},{"$f":"'402B Input'!M16","v":0},{"$f":"'402B Input'!N16","v":0},{"$f":"'402B Input'!O16","v":0}]
[{"$f":"'402B Input'!B17","v":"C.1.a.(b)"},{"$f":"'402B Input'!C17","v":"Base Positions Paid for DVOP Activities: (This Qtr)"},{"$f":"'402B Input'!D17","v":0},{"$f":"'402B Input'!E17","v":0},{"$f":"'402B Input'!F17","v":0},{"$f":"'402B Input'!G17","v":0},{"$f":"'402B Input'!H17","v":0},{"$f":"'402B Input'!I17","v":0},{"$f":"'402B Input'!J17","v":0},{"$f":"'402B Input'!K17","v":0},{"$f":"'402B Input'!L17","v":0},{"$f":"'402B Input'!M17","v":0},{"$f":"'402B Input'!N17","v":0},{"$f":"'402B Input'!O17","v":0}]
[{"$f":"'402B Input'!B18","v":"C.1.a.(c)"},{"$f":"'402B Input'!C18","v":"Base Positions Paid for DVOP Activities: (To Date)"},{"$f":"'402B Input'!D18","v":0},{"$f":"'402B Input'!E18","v":0},{"$f":"'402B Input'!F18","v":0},{"$f":"'402B Input'!G18","v":0},{"$f":"'402B Input'!H18","v":0},{"$f":"'402B Input'!I18","v":0},{"$f":"'402B Input'!J18","v":0},{"$f":"'402B Input'!K18","v":0},{"$f":"'402B Input'!L18","v":0},{"$f":"'402B Input'!M18","v":0},{"$f":"'402B Input'!N18","v":0},{"$f":"'402B Input'!O18","v":0}]
[{"$f":"'402B Input'!B19","v":"C.1.b.(a)"},{"$f":"'402B Input'!C19","v":"Personal Services (PS) for DVOP Activities: (Previous)"},{"$f":"ROUND('402B Input'!D19,0)","v":0},{"$f":"ROUND('402B Input'!E19,0)","v":0},{"$f":"ROUND('402B Input'!F19,0)","v":0},{"$f":"ROUND('402B Input'!G19,0)","v":0},{"$f":"ROUND('402B Input'!H19,0)","v":0},{"$f":"ROUND('402B Input'!I19,0)","v":0},{"$f":"ROUND('402B Input'!J19,0)","v":0},{"$f":"ROUND('402B Input'!K19,0)","v":0},{"$f":"ROUND('402B Input'!L19,0)","v":0},{"$f":"ROUND('402B Input'!M19,0)","v":0},{"$f":"ROUND('402B Input'!N19,0)","v":0},{"$f":"ROUND('402B Input'!O19,0)","v":0}]
{"$rows_left_out":66}
{"sheet":"Output_B","index":2,"n_rows":49,"n_cols":14,"rows_kept":49,"cut":false,"hidden":false,"merged":[[2,0,2,10],[0,3,0,7],[1,4,1,6],[12,0,12,10],[7,1,7,7],[6,0,6,10],[26,1,26,3],[27,1,27,3],[28,1,28,3],[43,0,43,10],[30,0,30,10],[38,0,38,10],[39,1,39,3],[40,1,40,3],[41,1,41,3],[31,1,31,3],[32,1,32,3],[33,1,33,3],[34,1,34,3],[35,1,35,3],[36,1,36,3],[9,1,9,2],[9,5,9,8],[10,5,10,8],[24,1,24,3],[25,1,25,3],[22,0,22,10],[14,0,14,10],[15,1,15,3],[16,1,16,3],[17,1,17,3],[18,1,18,3],[19,1,19,3],[20,1,20,3],[23,1,23,3],[44,5,44,7],[45,5,45,7],[46,5,46,7],[47,5,47,7],[48,3,48,7]]}
[null,null,null,"Jobs for Veterans State Grants Expenditure Detail Report",null,null,null,null,null,null,null,null,null,{"$f":"CONCATENATE($D$4,$D$5)","v":"044196"}]
[null,null,null,null,"Cumulative / Accrual Basis"]
["          SECTION A - GENERAL INFORMATION"]
[null,null,"1) State:",{"$f":"'402B Input'!D6","v":0},null,"3) Grant Number:",null,{"$f":"'402B Input'!C4","v":0},null,null,null,{"$f":"VLOOKUP(D5,Lists!$L$2:$O$13,2,)","v":"2021Q1"}]
[null,null,"2) Quarter Ending:","2020-12-31",null,"4) Date Prepared:",null,{"$f":"IF(ISERROR(GETPIVOTDATA(\"Max of Date Prepared\",Pivot_B!$A$1,\"State\",$D$4,\"FY_Q\",$D$5)),0,GETPIVOTDATA(\"Max of Date Prepared\",Pivot_B!$A$1,\"State\",$D$4,\"FY_Q\",$D$5))","v":"00:00:00"},null,null,null,{"$f":"VLOOKUP($D$5,Lists!$L$2:$O$14,3,)","v":"2020Q4"}]
[null,null,null,null,null,null,null,null,null,null,null,{"$f":"VLOOKUP($D$5,Lists!$L$2:$O$14,4,)","v":1},{"$f":"VLOOKUP($D$5,Lists!$L$2:$P$14,5,)","v":4}]
["         SECTION B - FUNDING INFORMATION"]
[null,"CUMULATIVE FUNDS APPROVED THROUGH THE END OF THIS REPORTING PERIOD FOR:"]
[null,null,"1) DVOP Total Funds:",{"$f":"IF(ISERROR(GETPIVOTDATA(\"Sum of DVOP Total Funds\",Pivot_B!$A$1,\"State\",$D$4,\"FY_Q\",$D$5)),0,GETPIVOTDATA(\"Sum of DVOP Total Funds\",Pivot_B!$A$1,\"State\",$D$4,\"FY_Q\",$D$5))","v":0},null,null,null,"3) LVER Total Funds:",null,{"$f":"IF(ISERROR(GETPIVOTDATA(\"Sum of Lver Total Funds\",Pivot_B!$A$1,\"State\",$D$4,\"FY_Q\",$D$5)),0,GETPIVOTDATA(\"Sum of Lver Total Funds\",Pivot_B!$A$1,\"State\",$D$4,\"FY_Q\",$D$5))","v":0}]
[null,"2) Consolidated DVOP/LVER Total Funds:",null,{"$f":"IF(ISERROR(GETPIVOTDATA(\"Sum of Consolidated Total Funds\",Pivot_B!$A$1,\"State\",$D$4,\"FY_Q\",$D$5)),0,GETPIVOTDATA(\"Sum of Consolidated Total Funds\",Pivot_B!$A$1,\"State\",$D$4,\"FY_Q\",$D$5))","v":0},null,"4) Incentive Award Total Funds:",null,null,null,{"$f":"IF(ISERROR(GETPIVOTDATA(\"Sum of Incentive Award Total Funds\",Pivot_B!$A$1,\"State\",$D$4,\"FY_Q\",$D$5)),0,GETPIVOTDATA(\"Sum of Incentive Award Total Funds\",Pivot_B!$A$1,\"State\",$D$4,\"FY_Q\",$D$5))","v":0}]
[null,null,null,null,null,"5) Total Approved Funds (Crosswalk with FFR Line 10.d):",null,null,null,{"$f":"ROUND((SUM(D9:D10:J9:J10)),0)","v":0}]
[]
["      SECTION C - EXPENDITURE INFORMATION"]
[null,null,null,null,null,"Previously Reported\n(a)",null,"Reported this Quarter\n(b)",null,"Reported YTD\n(c)"]
[" 1)  DVOP Expenditures  "]
{"$rows_left_out":35}
{"sheet":"Pivot_B","index":3,"n_rows":6,"n_cols":76,"rows_kept":6,"cut":false,"hidden":true,"merged":[]}
["Row Labels","Max of Grant Number","Max of Date Prepared","Sum of DVOP Total Funds","Sum of Consolidated Total Funds","Sum of LVER Total Funds","Sum of Incentive Award Total Funds","Sum of Total Approved Funds","Sum of DVOP BPP (Previous)","Sum of DVOP BPP (This Qtr)","Sum of DVOP BPP (YTD)","Sum of DVOP PS (Previous)","Sum of DVOP PS (This Qtr)","Sum of DVOP PS (YTD)","Sum of DVOP PB (Previous)","Sum of DVOP PB (This Qtr)","Sum of DVOP PB (YTD)","Sum of Total DVOP Outlays (Previous)","Sum of Total DVOP Outlays (This Qtr)","Sum of Total DVOP Outlays (YTD)","Sum of DVOP Unliquidated Obs (Previous)","Sum of DVOP Unliquidated Obs (This Qtr)","Sum of DVOP Unliquidated Obs (YTD)","Sum of Total DVOP Outlays & Obs (Previous)","Sum of Total DVOP Outlays & Obs (This Qtr)","Sum of Total DVOP Outlays & Obs (YTD)","Sum of Cons Unliquidated Obs (This Qtr)","Sum of Cons BPP (This Qtr)","Sum of Incentive Unliquidated Obs (This Qtr)","Sum of Total Incentive Outlays (This Qtr)","Sum of Cons BPP (Previous)","Sum of Cons BPP (YTD)","Sum of Cons PS (Previous)","Sum of Cons PS (This Qtr)","Sum of Cons PS (YTD)","Sum of LVER BPP (This Qtr)","Sum of Total LVER Outlays (This Qtr)","Sum of Cons PB (Previous)","Sum of Cons PB (This Qtr)","Sum of Total Incentive Outlays & Obs (Previous)","Sum of Cons PB (YTD)","Sum of Total Cons Outlays (Previous)","Sum of Total Cons Outlays (This Qtr)","Sum of Total Cons Outlays (YTD)","Sum of Cons Unliquidated Obs (Previous)","Sum of Total Cons Outlays & Obs (Previous)","Sum of Cons Unliquidated Obs (YTD)","Sum of Total Incentive Outlays & Obs (This Qtr)","Sum of Total Cons Outlays & Obs (This Qtr)","Sum of Total Cons Outlays & Obs (YTD)","Sum of LVER BPP (Previous)","Sum of LVER BPP (YTD)","Sum of LVER PS (Previous)","Sum of LVER PS (This Qtr)","Sum of LVER PS (YTD)","Sum of LVER PB (Previous)","Sum of LVER PB (This Qtr)","Sum of LVER PB (YTD)","Sum of Total LVER Outlays (Previous)","Sum of Total LVER Outlays (YTD)","Sum of LVER Unliquidated Obs (Previous)","Sum of LVER Unliquidated Obs (This Qtr)","Sum of LVER Unliquidated Obs (YTD)","Sum of Total LVER Outlays & Obs (Previous)","Sum of Total LVER Outlays & Obs (This Qtr)","Sum of Total LVER Outlays & Obs (YTD)","Sum of Total Incentive Outlays (Previous)","Sum of Total Incentive Outlays (YTD)","Sum of Incentive Unliquidated Obs (Previous)","Sum of Incentive Unliquidated Obs (YTD)","Sum of Total Incentive Outlays & Obs (YTD)","Sum of Total DVOP Balance Remaining","Sum of Total Cons Balance Remaining","Sum of Total LVER Balance Remaining","Sum of Total Incentive Balance Remaining","Sum of Total Balance Remaining"]
["(blank)"]
["(blank)"]
[0]
[null,0,"00:00:00",0,0,0,0,0,0,0,0,0,0,0,0,0,0,0,0,0,0,0,0,0,0,0,0,0,0,0,0,0,0,0,0,0,0,0,0,0,0,0,0,0,0,0,0,0,0,0,0,0,0,0,0,0,0,0,0,0,0,0,0,0,0,0,0,0,0,0,0,0,0,0,0,0]
["Grand Total",0,"00:00:00",0,0,0,0,0,0,0,0,0,0,0,0,0,0,0,0,0,0,0,0,0,0,0,0,0,0,0,0,0,0,0,0,0,0,0,0,0,0,0,0,0,0,0,0,0,0,0,0,0,0,0,0,0,0,0,0,0,0,0,0,0,0,0,0,0,0,0,0,0,0,0,0,0]

{"sheet":"Data_B","index":4,"n_rows":13,"n_cols":80,"rows_kept":13,"cut":false,"hidden":true,"merged":[]}
["State","FY_Q","Grant Number","Date Prepared","Final Report","DVOP Total Funds","Consolidated Total Funds","LVER Total Funds","Incentive Award Total Funds","Total Approved Funds","DVOP BPP (Previous)","DVOP BPP (This Qtr)","DVOP BPP (YTD)","DVOP PS (Previous)","DVOP PS (This Qtr)","DVOP PS (YTD)","DVOP PB (Previous)","DVOP PB (This Qtr)","DVOP PB (YTD)","Total DVOP Outlays (Previous)","Total DVOP Outlays (This Qtr)","Total DVOP Outlays (YTD)","DVOP Unliquidated Obs (Previous)","DVOP Unliquidated Obs (This Qtr)","DVOP Unliquidated Obs (YTD)","Total DVOP Outlays & Obs (Previous)","Total DVOP Outlays & Obs (This Qtr)","Total DVOP Outlays & Obs (YTD)","Cons BPP (Previous)","Cons BPP (This Qtr)","Cons BPP (YTD)","Cons PS (Previous)","Cons PS (This Qtr)","Cons PS (YTD)","Cons PB (Previous)","Cons PB (This Qtr)","Cons PB (YTD)","Total Cons Outlays (Previous)","Total Cons Outlays (This Qtr)","Total Cons Outlays (YTD)","Cons Unliquidated Obs (Previous)","Cons Unliquidated Obs (This Qtr)","Cons Unliquidated Obs (YTD)","Total Cons Outlays & Obs (Previous)","Total Cons Outlays & Obs (This Qtr)","Total Cons Outlays & Obs (YTD)","LVER BPP (Previous)","LVER BPP (This Qtr)","LVER BPP (YTD)","LVER PS (Previous)","LVER PS (This Qtr)","LVER PS (YTD)","LVER PB (Previous)","LVER PB (This Qtr)","LVER PB (YTD)","Total LVER Outlays (Previous)","Total LVER Outlays (This Qtr)","Total LVER Outlays (YTD)","LVER Unliquidated Obs (Previous)","LVER Unliquidated Obs (This Qtr)","LVER Unliquidated Obs (YTD)","Total LVER Outlays & Obs (Previous)","Total LVER Outlays & Obs (This Qtr)","Total LVER Outlays & Obs (YTD)","Total Incentive Outlays (Previous)","Total Incentive Outlays (This Qtr)","Total Incentive Outlays (YTD)","Incentive Unliquidated Obs (Previous)","Incentive Unliquidated Obs (This Qtr)","Incentive Unliquidated Obs (YTD)","Total Incentive Outlays & Obs (Previous)","Total Incentive Outlays & Obs (This Qtr)","Total Incentive Outlays & Obs (YTD)","Total DVOP Balance Remaining","Total Cons Balance Remaining","Total LVER Balance Remaining","Total Incentive Balance Remaining","Total Balance Remaining","Code"]
[{"$f":"TRANSPOSE('402B Input'!D6:O85)","v":0},"",0,"00:00:00",0,0,0,0,0,0,0,0,0,0,0,0,0,0,0,0,0,0,0,0,0,0,0,0,0,0,0,0,0,0,0,0,0,0,0,0,0,0,0,0,0,0,0,0,0,0,0,0,0,0,0,0,0,0,0,0,0,0,0,0,0,0,0,0,0,0,0,0,0,0,0,0,0,0,0,0]
[0,"",0,"00:00:00",0,0,0,0,0,0,0,0,0,0,0,0,0,0,0,0,0,0,0,0,0,0,0,0,0,0,0,0,0,0,0,0,0,0,0,0,0,0,0,0,0,0,0,0,0,0,0,0,0,0,0,0,0,0,0,0,0,0,0,0,0,0,0,0,0,0,0,0,0,0,0,0,0,0,0,0]
[0,"",0,"00:00:00",0,0,0,0,0,0,0,0,0,0,0,0,0,0,0,0,0,0,0,0,0,0,0,0,0,0,0,0,0,0,0,0,0,0,0,0,0,0,0,0,0,0,0,0,0,0,0,0,0,0,0,0,0,0,0,0,0,0,0,0,0,0,0,0,0,0,0,0,0,0,0,0,0,0,0,0]
[0,"",0,"00:00:00",0,0,0,0,0,0,0,0,0,0,0,0,0,0,0,0,0,0,0,0,0,0,0,0,0,0,0,0,0,0,0,0,0,0,0,0,0,0,0,0,0,0,0,0,0,0,0,0,0,0,0,0,0,0,0,0,0,0,0,0,0,0,0,0,0,0,0,0,0,0,0,0,0,0,0,0]
[0,"",0,"00:00:00",0,0,0,0,0,0,0,0,0,0,0,0,0,0,0,0,0,0,0,0,0,0,0,0,0,0,0,0,0,0,0,0,0,0,0,0,0,0,0,0,0,0,0,0,0,0,0,0,0,0,0,0,0,0,0,0,0,0,0,0,0,0,0,0,0,0,0,0,0,0,0,0,0,0,0,0]
[0,"",0,"00:00:00",0,0,0,0,0,0,0,0,0,0,0,0,0,0,0,0,0,0,0,0,0,0,0,0,0,0,0,0,0,0,0,0,0,0,0,0,0,0,0,0,0,0,0,0,0,0,0,0,0,0,0,0,0,0,0,0,0,0,0,0,0,0,0,0,0,0,0,0,0,0,0,0,0,0,0,0]
[0,"",0,"00:00:00",0,0,0,0,0,0,0,0,0,0,0,0,0,0,0,0,0,0,0,0,0,0,0,0,0,0,0,0,0,0,0,0,0,0,0,0,0,0,0,0,0,0,0,0,0,0,0,0,0,0,0,0,0,0,0,0,0,0,0,0,0,0,0,0,0,0,0,0,0,0,0,0,0,0,0,0]
[0,"",0,"00:00:00",0,0,0,0,0,0,0,0,0,0,0,0,0,0,0,0,0,0,0,0,0,0,0,0,0,0,0,0,0,0,0,0,0,0,0,0,0,0,0,0,0,0,0,0,0,0,0,0,0,0,0,0,0,0,0,0,0,0,0,0,0,0,0,0,0,0,0,0,0,0,0,0,0,0,0,0]
[0,"",0,"00:00:00",0,0,0,0,0,0,0,0,0,0,0,0,0,0,0,0,0,0,0,0,0,0,0,0,0,0,0,0,0,0,0,0,0,0,0,0,0,0,0,0,0,0,0,0,0,0,0,0,0,0,0,0,0,0,0,0,0,0,0,0,0,0,0,0,0,0,0,0,0,0,0,0,0,0,0,0]
[0,"",0,"00:00:00",0,0,0,0,0,0,0,0,0,0,0,0,0,0,0,0,0,0,0,0,0,0,0,0,0,0,0,0,0,0,0,0,0,0,0,0,0,0,0,0,0,0,0,0,0,0,0,0,0,0,0,0,0,0,0,0,0,0,0,0,0,0,0,0,0,0,0,0,0,0,0,0,0,0,0,0]
[0,"",0,"00:00:00",0,0,0,0,0,0,0,0,0,0,0,0,0,0,0,0,0,0,0,0,0,0,0,0,0,0,0,0,0,0,0,0,0,0,0,0,0,0,0,0,0,0,0,0,0,0,0,0,0,0,0,0,0,0,0,0,0,0,0,0,0,0,0,0,0,0,0,0,0,0,0,0,0,0,0,"Revised February 2022"]
[0,"",0,"00:00:00",0,0,0,0,0,0,0,0,0,0,0,0,0,0,0,0,0,0,0,0,0,0,0,0,0,0,0,0,0,0,0,0,0,0,0,0,0,0,0,0,0,0,0,0,0,0,0,0,0,0,0,0,0,0,0,0,0,0,0,0,0,0,0,0,0,0,0,0,0,0,0,0,0,0,"VETS-402 B",0]

{"sheet":"Lists","index":5,"n_rows":55,"n_cols":30,"rows_kept":55,"cut":false,"hidden":true,"merged":[]}
["State Number","ST","State"]
[1,"AL","ALABAMA",null,null,null,null,null,null,null,null,"2019-12-31","2020Q1","2019Q4",1,4]
[2,"AK","ALASKA",null,null,null,null,null,null,null,null,"2020-03-31","2020Q2","2020Q1",2,1]
[4,"AZ","ARIZONA",null,null,null,null,null,null,null,null,"2020-06-30","2020Q3","2020Q2",3,2]
[5,"AR","ARKANSAS",null,null,null,null,null,null,null,null,"2020-09-30","2020Q4","2020Q3",4,3]
[6,"CA","CALIFORNIA",null,null,null,null,null,null,null,null,"2020-12-31","2021Q1","2020Q4",1,4]
[8,"CO","COLORADO",null,null,null,null,null,null,null,null,"2021-03-31","2021Q2","2021Q1",2,4]
[9,"CT","CONNECTICUT",null,null,null,null,null,null,null,null,"2021-06-30","2021Q3","2021Q2",3,1]
[10,"DE","DELAWARE",null,null,null,null,null,null,null,null,"2021-09-30","2021Q4","2021Q3",4,2]
[11,"DC","DISTRICT OF COLUMBIA",null,null,null,null,null,null,null,null,"2021-12-31","2022Q1","2021Q4",1,3]
[12,"FL","FLORIDA",null,null,null,null,null,null,null,null,"2022-03-31","2022Q2","2022Q1",2,4]
[13,"GA","GEORGIA",null,null,null,null,null,null,null,null,"2022-06-30","2022Q3","2022Q2",3,4]
[15,"HI","HAWAII",null,null,null,null,null,null,null,null,"2022-09-30","2022Q4","2022Q3",4,1]
[16,"ID","IDAHO"]
[17,"IL","ILLINOIS"]
{"$rows_left_out":40}